{"text_format":"1","workbook":"xlsx","n_sheets":9,"sheets":["Drop Down Lists","Instructions","Roll Up","HV1","HV2","HV3","HV4","HV5","HV6"],"not_rendered":{"charts":0,"images":2,"macros":1,"external_links":0,"defined_names":12,"comments":0,"pivot_tables":0},"unopened":[],"bounds":{"document_bytes":16777216,"sheet_cells":100000,"rows_first":2000,"rows_last":500,"rows_between":2000,"halvings":0,"cell_chars":16384,"cell_head_chars":4096},"cells_cut":0,"cells_raw":0,"read":"whole","date_system":"1900"}

{"sheet":"Drop Down Lists","index":0,"n_rows":5,"n_cols":2,"rows_kept":5,"cut":false,"hidden":true,"merged":[]}
["Typical","Typical result"]
["Monitoring required (grey)","Referred to E.I."]
["Delays indicated (black)","Connected to E.I."]
[null,"Parent decl. E.I."]
[null,"Info./act. to support dev."]

{"sheet":"Instructions","index":1,"n_rows":39,"n_cols":1,"rows_kept":39,"cut":false,"hidden":false,"merged":[]}
[]
[]
[]
[]
[]
[]
[]
["Standard 6-6.B: ASQ's"]
[]
["As stated in the Best Practice Standard, under 6-6.B, it is the expectation that:"]
["The site ensures that the ASQ (Ages and Stages Questionnaire) is used during home visits to monitor child development at specified intervals unless developmentally inappropriate, and is administered according to the developers' instructions to ensure valid results (i.e. administered during the specified window of time)."]
["Intent: All target children are screened for potential developmental delays according to the minimum frequency recommended by the Association for the Academy of Pediatrics.  Staff are not required to screen children that are enrolled in early intervention services (special needs) and are receiving in-depth developmental assessments. "]
[]
[]
["You will enter data in the yellow highlighted AND in the \"Result\" and \"Action\" fields only"]
{"$rows_left_out":25}
{"sheet":"Roll Up","index":2,"n_rows":11,"n_cols":12,"rows_kept":11,"cut":false,"hidden":false,"merged":[[2,1,2,11],[3,1,3,11]]}
[null,null,null,null,null,null,5]
[]
[null,"ASQ Roll Up"]
[null,"DO NOT WRITE ON THIS PAGE, THIS WILL CALCULATE THE DATA YOU ENTER ON THE OTHER TABS."]
[null,"Home Visitor","Target children measured  at 1 year","YR 1","Target children measured at 2 years","YR 2","Target children measured at 3 years","YR 3 ","Target children measured at 4 years","YR 4","Target children measured at 5 years","YR 5"]
[null,{"$f":"IF(ISBLANK('HV1'!B$10),\"\",'HV1'!B$10)","v":""},{"$f":"COUNTIF('HV1'!$F$17:$F$47,\">=0\")","v":0},{"$f":"'HV1'!$F$15","v":{"$error":"#DIV/0!"}},{"$f":"COUNTIF('HV1'!$G$17:$G$47,\">=0\")","v":0},{"$f":"'HV1'!$G$15","v":{"$error":"#DIV/0!"}},{"$f":"COUNTIF('HV1'!$H$17:$H$47,\">=0\")","v":0},{"$f":"'HV1'!$H$15","v":{"$error":"#DIV/0!"}},{"$f":"COUNTIF('HV1'!$I$17:$I$47,\">=0\")","v":0},{"$f":"'HV1'!$I$15","v":{"$error":"#DIV/0!"}},{"$f":"COUNTIF('HV1'!$J$17:$J$47,\">=0\")","v":0},{"$f":"'HV1'!$J$15","v":{"$error":"#DIV/0!"}}]
[null,{"$f":"IF(ISBLANK('HV2'!B$10),\"\",'HV2'!B$10)","v":""},{"$f":"COUNTIF('HV2'!$F$17:$F$47,\">=0\")","v":0},{"$f":"'HV2'!$F$15","v":{"$error":"#DIV/0!"}},{"$f":"COUNTIF('HV2'!$G$17:$G$47,\">=0\")","v":0},{"$f":"'HV2'!$G$15","v":{"$error":"#DIV/0!"}},{"$f":"COUNTIF('HV2'!$H$17:$H$47,\">=0\")","v":0},{"$f":"'HV2'!$H$15","v":{"$error":"#DIV/0!"}},{"$f":"COUNTIF('HV2'!$I$17:$I$47,\">=0\")","v":0},{"$f":"'HV2'!$I$15","v":{"$error":"#DIV/0!"}},{"$f":"COUNTIF('HV2'!$J$17:$J$47,\">=0\")","v":0},{"$f":"'HV2'!$J$15","v":{"$error":"#DIV/0!"}}]
[null,{"$f":"IF(ISBLANK('HV3'!B$10),\"\",'HV3'!B$10)","v":""},{"$f":"COUNTIF('HV3'!$F$17:$F$47,\">=0\")","v":0},{"$f":"'HV3'!$F$15","v":{"$error":"#DIV/0!"}},{"$f":"COUNTIF('HV3'!$G$17:$G$47,\">=0\")","v":0},{"$f":"'HV3'!$G$15","v":{"$error":"#DIV/0!"}},{"$f":"COUNTIF('HV3'!$H$17:$H$47,\">=0\")","v":0},{"$f":"'HV3'!$H$15","v":{"$error":"#DIV/0!"}},{"$f":"COUNTIF('HV3'!$I$17:$I$47,\">=0\")","v":0},{"$f":"'HV3'!$I$15","v":{"$error":"#DIV/0!"}},{"$f":"COUNTIF('HV3'!$J$17:$J$47,\">=0\")","v":0},{"$f":"'HV3'!$J$15","v":{"$error":"#DIV/0!"}}]
[null,{"$f":"IF(ISBLANK('HV4'!B$10),\"\",'HV4'!B$10)","v":""},{"$f":"COUNTIF('HV4'!$F$17:$F$47,\">=0\")","v":0},{"$f":"'HV4'!$F$15","v":{"$error":"#DIV/0!"}},{"$f":"COUNTIF('HV4'!$G$17:$G$47,\">=0\")","v":0},{"$f":"'HV4'!$G$15","v":{"$error":"#DIV/0!"}},{"$f":"COUNTIF('HV4'!$H$17:$H$47,\">=0\")","v":0},{"$f":"'HV4'!$H$15","v":{"$error":"#DIV/0!"}},{"$f":"COUNTIF('HV4'!$I$17:$I$47,\">=0\")","v":0},{"$f":"'HV4'!$I$15","v":{"$error":"#DIV/0!"}},{"$f":"COUNTIF('HV4'!$J$17:$J$47,\">=0\")","v":0},{"$f":"'HV4'!$J$15","v":{"$error":"#DIV/0!"}}]
[null,{"$f":"IF(ISBLANK('HV5'!B$10),\"\",'HV5'!B$10)","v":""},{"$f":"COUNTIF('HV5'!$F$17:$F$47,\">=0\")","v":0},{"$f":"'HV5'!$F$15","v":{"$error":"#DIV/0!"}},{"$f":"COUNTIF('HV5'!$G$17:$G$47,\">=0\")","v":0},{"$f":"'HV5'!$G$15","v":{"$error":"#DIV/0!"}},{"$f":"COUNTIF('HV5'!$H$17:$H$47,\">=0\")","v":0},{"$f":"'HV5'!$H$15","v":{"$error":"#DIV/0!"}},{"$f":"COUNTIF('HV5'!$I$17:$I$47,\">=0\")","v":0},{"$f":"'HV5'!$I$15","v":{"$error":"#DIV/0!"}},{"$f":"COUNTIF('HV5'!$J$17:$J$47,\">=0\")","v":0},{"$f":"'HV5'!$J$15","v":{"$error":"#DIV/0!"}}]
[null,{"$f":"IF(ISBLANK('HV6'!B$10),\"\",'HV6'!B$10)","v":""},{"$f":"COUNTIF('HV6'!$F$17:$F$47,\">=0\")","v":0},{"$f":"'HV6'!$F$15","v":{"$error":"#DIV/0!"}},{"$f":"COUNTIF('HV6'!$G$17:$G$47,\">=0\")","v":0},{"$f":"'HV6'!$G$15","v":{"$error":"#DIV/0!"}},{"$f":"COUNTIF('HV6'!$H$17:$H$47,\">=0\")","v":0},{"$f":"'HV6'!$H$15","v":{"$error":"#DIV/0!"}},{"$f":"COUNTIF('HV6'!$I$17:$I$47,\">=0\")","v":0},{"$f":"'HV6'!$I$15","v":{"$error":"#DIV/0!"}},{"$f":"COUNTIF('HV6'!$J$17:$J$47,\">=0\")","v":0},{"$f":"'HV6'!$J$15","v":{"$error":"#DIV/0!"}}]

{"sheet":"HV1","index":3,"n_rows":47,"n_cols":115,"rows_kept":47,"cut":false,"hidden":false,"merged":[[5,1,5,56],[6,1,6,56],[7,1,7,56],[9,27,9,31],[8,1,8,56]]}
[null,"6-6.B ASQ Developmental Screening Tracking"]
[]
[null,"Instructions:  ","HFA requires a minimum of two valid screens per year until the age 3, and one per year thereafter. "]
[null,"Enter in yellow highlighted fields only"]
[null,"*There is enough space to enter data for 30 families for 6 HV's. If you require more space for data entry, please contact Amy: arussell@preventchildabuse.org*"]
[null,"The blue columns are automatically calculating the dates each ASQ is due; the \"Valid?\" columns automatically calculate whether the date completed was within a month (before or after)"]
[null," of the due date, the grey columns take those into account when calculating the total number of screens per year. If the target child has not reached their next birthday,"]
[null," that column will be marked \"N/A\". You will also notice there are embedded calculations specificying the percentage of children at each age who are meeting the 6-6.B requirements."]
[null,"For each new fiscal year, beging entering new ASQ screens starting July 1. However ALSO INCLUDE (enter) the last completed ASQ from the prior fiscal year."]
["Home Visitor"]
["Supervisor:"]
["Service Year: July 1, 2016 – June 30, 2017"]
["Highlight data from:",null,{"$f":"IF(ISBLANK(C12),\"\",EDATE(C12, -6))","v":""}]
["# Target Children",null,{"$f":"COUNTA(A17:A43)","v":0}]
["Percentage Meeting Requirements",null,null,null,null,{"$f":"COUNTIF(F17:F47,\">=2\")/COUNTIF(F17:F47,\">=0\")","v":{"$error":"#DIV/0!"}},{"$f":"COUNTIF(G17:G47,\">=2\")/COUNTIF(G17:G47,\">=0\")","v":{"$error":"#DIV/0!"}},{"$f":"COUNTIF(H17:H47,\">=2\")/COUNTIF(H17:H47,\">=0\")","v":{"$error":"#DIV/0!"}},{"$f":"COUNTIF(I17:I47,\">=1\")/COUNTIF(I17:I47,\">=0\")","v":{"$error":"#DIV/0!"}},{"$f":"COUNTIF(J17:J47,\">=1\")/COUNTIF(J17:J47,\">=0\")","v":{"$error":"#DIV/0!"}}]
{"$rows_left_out":33}
{"sheet":"HV2","index":4,"n_rows":47,"n_cols":115,"rows_kept":47,"cut":false,"hidden":false,"merged":[[9,27,9,31],[5,1,5,56],[6,1,6,56],[7,1,7,56],[8,1,8,56]]}
[null,"6-6.B ASQ Developmental Screening Tracking"]
[]
[null,"Instructions:  ","HFA requires a minimum of two valid screens per year until the age 3, and one per year thereafter. "]
[null,"Enter in yellow highlighted fields only"]
[null,"*There is enough space to enter data for 30 families for 6 HV's. If you require more space for data entry, please contact Amy: arussell@preventchildabuse.org*"]
[null,"The blue columns are automatically calculating the dates each ASQ is due; the \"Valid?\" columns automatically calculate whether the date completed was within a month (before or after)"]
[null," of the due date, the grey columns take those into account when calculating the total number of screens per year. If the target child has not reached their next birthday,"]
[null," that column will be marked \"N/A\". You will also notice there are embedded calculations specificying the percentage of children at each age who are meeting the 6-6.B requirements."]
[null,"For each new fiscal year, beging entering new ASQ screens starting July 1. However ALSO INCLUDE (enter) the last completed ASQ from the prior fiscal year."]
["Home Visitor"]
["Supervisor:"]
["Today's Date"]
["Highlight data from:",null,{"$f":"IF(ISBLANK(C12),\"\",EDATE(C12, -6))","v":""}]
["# Target Children",null,{"$f":"COUNTA(A17:A43)","v":0}]
["Percentage Meeting Requirements",null,null,null,null,{"$f":"COUNTIF(F17:F47,\">=2\")/COUNTIF(F17:F47,\">=0\")","v":{"$error":"#DIV/0!"}},{"$f":"COUNTIF(G17:G47,\">=2\")/COUNTIF(G17:G47,\">=0\")","v":{"$error":"#DIV/0!"}},{"$f":"COUNTIF(H17:H47,\">=2\")/COUNTIF(H17:H47,\">=0\")","v":{"$error":"#DIV/0!"}},{"$f":"COUNTIF(I17:I47,\">=1\")/COUNTIF(I17:I47,\">=0\")","v":{"$error":"#DIV/0!"}},{"$f":"COUNTIF(J17:J47,\">=1\")/COUNTIF(J17:J47,\">=0\")","v":{"$error":"#DIV/0!"}}]
{"$rows_left_out":33}
{"sheet":"HV3","index":5,"n_rows":47,"n_cols":115,"rows_kept":47,"cut":false,"hidden":false,"merged":[[9,27,9,31],[5,1,5,56],[6,1,6,56],[7,1,7,56],[8,1,8,56]]}
[null,"6-6.B ASQ Developmental Screening Tracking"]
[]
[null,"Instructions:  ","HFA requires a minimum of two valid screens per year until the age 3, and one per year thereafter. "]
[null,"Enter in yellow highlighted fields only"]
[null,"*There is enough space to enter data for 30 families for 6 HV's. If you require more space for data entry, please contact Amy: arussell@preventchildabuse.org*"]
[null,"The blue columns are automatically calculating the dates each ASQ is due; the \"Valid?\" columns automatically calculate whether the date completed was within a month (before or after)"]
[null," of the due date, the grey columns take those into account when calculating the total number of screens per year. If the target child has not reached their next birthday,"]
[null," that column will be marked \"N/A\". You will also notice there are embedded calculations specificying the percentage of children at each age who are meeting the 6-6.B requirements."]
[null,"For each new fiscal year, beging entering new ASQ screens starting July 1. However ALSO INCLUDE (enter) the last completed ASQ from the prior fiscal year."]
["Home Visitor"]
["Supervisor:"]
["Today's Date"]
["Highlight data from:",null,{"$f":"IF(ISBLANK(C12),\"\",EDATE(C12, -6))","v":""}]
["# Target Children",null,{"$f":"COUNTA(A17:A43)","v":0}]
["Percentage Meeting Requirements",null,null,null,null,{"$f":"COUNTIF(F17:F47,\">=2\")/COUNTIF(F17:F47,\">=0\")","v":{"$error":"#DIV/0!"}},{"$f":"COUNTIF(G17:G47,\">=2\")/COUNTIF(G17:G47,\">=0\")","v":{"$error":"#DIV/0!"}},{"$f":"COUNTIF(H17:H47,\">=2\")/COUNTIF(H17:H47,\">=0\")","v":{"$error":"#DIV/0!"}},{"$f":"COUNTIF(I17:I47,\">=1\")/COUNTIF(I17:I47,\">=0\")","v":{"$error":"#DIV/0!"}},{"$f":"COUNTIF(J17:J47,\">=1\")/COUNTIF(J17:J47,\">=0\")","v":{"$error":"#DIV/0!"}}]
{"$rows_left_out":33}
{"sheet":"HV4","index":6,"n_rows":47,"n_cols":115,"rows_kept":47,"cut":false,"hidden":false,"merged":[[9,27,9,31],[5,1,5,56],[6,1,6,56],[7,1,7,56],[8,1,8,56]]}
[null,"6-6.B ASQ Developmental Screening Tracking"]
[]
[null,"Instructions:  ","HFA requires a minimum of two valid screens per year until the age 3, and one per year thereafter. "]
[null,"Enter in yellow highlighted fields only"]
[null,"*There is enough space to enter data for 30 families for 6 HV's. If you require more space for data entry, please contact Amy: arussell@preventchildabuse.org*"]
[null,"The blue columns are automatically calculating the dates each ASQ is due; the \"Valid?\" columns automatically calculate whether the date completed was within a month (before or after)"]
[null," of the due date, the grey columns take those into account when calculating the total number of screens per year. If the target child has not reached their next birthday,"]
[null," that column will be marked \"N/A\". You will also notice there are embedded calculations specificying the percentage of children at each age who are meeting the 6-6.B requirements."]
[null,"For each new fiscal year, beging entering new ASQ screens starting July 1. However ALSO INCLUDE (enter) the last completed ASQ from the prior fiscal year."]
["Home Visitor"]
["Supervisor:"]
["Today's Date"]
["Highlight data from:",null,{"$f":"IF(ISBLANK(C12),\"\",EDATE(C12, -6))","v":""}]
["# Target Children",null,{"$f":"COUNTA(A17:A43)","v":0}]
["Percentage Meeting Requirements",null,null,null,null,{"$f":"COUNTIF(F17:F47,\">=2\")/COUNTIF(F17:F47,\">=0\")","v":{"$error":"#DIV/0!"}},{"$f":"COUNTIF(G17:G47,\">=2\")/COUNTIF(G17:G47,\">=0\")","v":{"$error":"#DIV/0!"}},{"$f":"COUNTIF(H17:H47,\">=2\")/COUNTIF(H17:H47,\">=0\")","v":{"$error":"#DIV/0!"}},{"$f":"COUNTIF(I17:I47,\">=1\")/COUNTIF(I17:I47,\">=0\")","v":{"$error":"#DIV/0!"}},{"$f":"COUNTIF(J17:J47,\">=1\")/COUNTIF(J17:J47,\">=0\")","v":{"$error":"#DIV/0!"}}]
{"$rows_left_out":33}
{"sheet":"HV5","index":7,"n_rows":47,"n_cols":115,"rows_kept":47,"cut":false,"hidden":false,"merged":[[9,27,9,31],[5,1,5,56],[6,1,6,56],[7,1,7,56],[8,1,8,56]]}
[null,"6-6.B ASQ Developmental Screening Tracking"]
[]
[null,"Instructions:  ","HFA requires a minimum of two valid screens per year until the age 3, and one per year thereafter. "]
[null,"Enter in yellow highlighted fields only"]
[null,"*There is enough space to enter data for 30 families for 6 HV's. If you require more space for data entry, please contact Amy: arussell@preventchildabuse.org*"]
[null,"The blue columns are automatically calculating the dates each ASQ is due; the \"Valid?\" columns automatically calculate whether the date completed was within a month (before or after)"]
[null," of the due date, the grey columns take those into account when calculating the total number of screens per year. If the target child has not reached their next birthday,"]
[null," that column will be marked \"N/A\". You will also notice there are embedded calculations specificying the percentage of children at each age who are meeting the 6-6.B requirements."]
[null,"For each new fiscal year, beging entering new ASQ screens starting July 1. However ALSO INCLUDE (enter) the last completed ASQ from the prior fiscal year."]
["Home Visitor"]
["Supervisor:"]
["Today's Date"]
["Highlight data from:",null,{"$f":"IF(ISBLANK(C12),\"\",EDATE(C12, -6))","v":""}]
["# Target Children",null,{"$f":"COUNTA(A17:A43)","v":0}]
["Percentage Meeting Requirements",null,null,null,null,{"$f":"COUNTIF(F17:F47,\">=2\")/COUNTIF(F17:F47,\">=0\")","v":{"$error":"#DIV/0!"}},{"$f":"COUNTIF(G17:G47,\">=2\")/COUNTIF(G17:G47,\">=0\")","v":{"$error":"#DIV/0!"}},{"$f":"COUNTIF(H17:H47,\">=2\")/COUNTIF(H17:H47,\">=0\")","v":{"$error":"#DIV/0!"}},{"$f":"COUNTIF(I17:I47,\">=1\")/COUNTIF(I17:I47,\">=0\")","v":{"$error":"#DIV/0!"}},{"$f":"COUNTIF(J17:J47,\">=1\")/COUNTIF(J17:J47,\">=0\")","v":{"$error":"#DIV/0!"}}]
{"$rows_left_out":33}
{"sheet":"HV6","index":8,"n_rows":47,"n_cols":115,"rows_kept":47,"cut":false,"hidden":false,"merged":[[9,27,9,31],[5,1,5,56],[6,1,6,56],[7,1,7,56],[8,1,8,56]]}
[null,"6-6.B ASQ Developmental Screening Tracking"]
[]
[null,"Instructions:  ","HFA requires a minimum of two valid screens per year until the age 3, and one per year thereafter. "]
[null,"Enter in yellow highlighted fields only"]
[null,"*There is enough space to enter data for 30 families for 6 HV's. If you require more space for data entry, please contact Amy: arussell@preventchildabuse.org*"]
[null,"The blue columns are automatically calculating the dates each ASQ is due; the \"Valid?\" columns automatically calculate whether the date completed was within a month (before or after)"]
[null," of the due date, the grey columns take those into account when calculating the total number of screens per year. If the target child has not reached their next birthday,"]
[null," that column will be marked \"N/A\". You will also notice there are embedded calculations specificying the percentage of children at each age who are meeting the 6-6.B requirements."]
[null,"For each new fiscal year, beging entering new ASQ screens starting July 1. However ALSO INCLUDE (enter) the last completed ASQ from the prior fiscal year."]
["Home Visitor"]
["Supervisor:"]
["Today's Date"]
["Highlight data from:",null,{"$f":"IF(ISBLANK(C12),\"\",EDATE(C12, -6))","v":""}]
["# Target Children",null,{"$f":"COUNTA(A17:A43)","v":0}]
["Percentage Meeting Requirements",null,null,null,null,{"$f":"COUNTIF(F17:F47,\">=2\")/COUNTIF(F17:F47,\">=0\")","v":{"$error":"#DIV/0!"}},{"$f":"COUNTIF(G17:G47,\">=2\")/COUNTIF(G17:G47,\">=0\")","v":{"$error":"#DIV/0!"}},{"$f":"COUNTIF(H17:H47,\">=2\")/COUNTIF(H17:H47,\">=0\")","v":{"$error":"#DIV/0!"}},{"$f":"COUNTIF(I17:I47,\">=1\")/COUNTIF(I17:I47,\">=0\")","v":{"$error":"#DIV/0!"}},{"$f":"COUNTIF(J17:J47,\">=1\")/COUNTIF(J17:J47,\">=0\")","v":{"$error":"#DIV/0!"}}]
{"$rows_left_out":32}